Firstname,Name,Email,Date of Birth,Mobile,Parent Name,Parent Mobile,Parent Email,Region,Sport,Call To Action,Message,Signedup By,Created,Interview,UTM Source,UTM Medium,UTM Campaign,UTM Term,UTM Content
Wamona,Wamona henriette,wamonahenrie@gmail.com,09/09/2003,2.43852E+11,Élisabeth mishika,2.4382E+11,julesngala@gmail.com,International / Other,Basketball,Request A Prospectus by Email,,Athlete,01/04/2019 19:40,Annabel,,,,,
Isla,Isla jackson,isjacks11@hotmail.co.uk,13/12/2001,7586351764,Gordon jackson,+44 7788 358772,gjhome@madasafish.com,Midlands,Soccer,Request A Prospectus by Email,,Athlete,01/04/2019 20:30,Max,,,,,
Jordan,Jordan dixon,jordandixon455@gmail.com,07/05/2002,7990635544,Kerry kiffin,07985 602250,kerrykiffin78@gmail.com,North England,Rugby,Request A Prospectus by Email,,Athlete,02/04/2019 02:47,Max,,,,,
Javid,Javid shaban,shabanfoot@gmail.com,01/07/2000,+33 6 95 80 04 86,Javid iqbal,+33 6 23 91 26 59,shabanjavidn77@gmail.com,International / Other,Soccer,Request A Prospectus by Email,,Athlete,02/04/2019 07:51,Matt,,,,,
Sam,Sam jojo,samjojov@gmail.com,,23278313379,,,,,,General Enquiry,,Athlete,01/04/2019 10:23,Sam,,,,,
Oliver,Oliver lock,oliverlock72@gmail.com,,7546275921,,,,,Soccer,General Enquiry,,Athlete,01/04/2019 14:31,Calum H,,,,,
Thomas,Thomas barker,thomasbarker20000@googlemail.com,,7933917363,,,,,Rugby,General Enquiry,,Athlete,01/04/2019 17:49,George,,,,,
Wamona,Wamona henriette,wamonahenrie@gmail.com,,2.43852E+11,,,,,,General Enquiry,,Athlete,01/04/2019 18:32,Ross,,,,,
Monisha,Monisha bhalla,monisha@veenus.com,,7769717174,,,,,Hockey,General Enquiry,,Athlete,01/04/2019 21:00,Annabel,,,,,
Lewis,Lewis minns ,lewisfoxminns@hotmail.co.uk,,7999364886,,,,,Football,General Enquiry,,Athlete,01/04/2019 21:31,Ross,,,,,
Tomiwa,Tomiwa oyewo ,tomioyewo4@gmail.com,06/02/1999,892257527,Betty oyewo,894829232,oyewo29@gmail.com,,Football,General Enquiry,,Athlete,02/04/2019 01:52,Matt,,,,,
Conor,Conor heasley ,conorules80@gmail.com,,7707043507,,,,,Rugby,General Enquiry,,Athlete,02/04/2019 06:59,Sam,,,,,
Bradley,Bradley smith ,bradleysmiffy@hotmail.co.uk,,,,,,,Football,More Information,is there a minimum handicap requirement? what grades do i need? and what is the minimum age?,Athlete,01/04/2019 09:57,Calum H,,,,,
Finlay,Finlay marney ,finlaymarney@hotmail.co.uk,,,,,,,Hockey,More Information,Does the hockey include men’s hockey ?,Athlete,01/04/2019 17:30,George,,,,,
Joshua,Joshua cuthbert,joshcuthbert752@gmail.com,,,,,,,Rugby,More Information,I would just like to inquire about the services you provide if i was to apply and also how much it costs,Athlete,01/04/2019 18:32,Ross,,,,,
Jack,Jack hodson,jacklfcfan@hotmail.co.uk,,,,,,,Rugby,More Information,I want to know more about the rugby scholarships,Athlete,01/04/2019 18:45,Annabel,,,,,
Patrick,Patrick kenny,pkennyr@gmail.com,,,,,,,Rugby,More Information,"Hello, I was just wondering what age bracket this scholarship program reguarded. Is it a university scholarship scheme?",Athlete,01/04/2019 20:27,George,,,,,
Jackson,Jackson mccawley,jacksonmccawley@hotmail.co.uk,,,,,,,Football,More Information,I would be very grateful if you would provide me on more information on american football scholarships ,Athlete,01/04/2019 21:51,Matt,,,,,
Ahmed,Ahmed abdirahman ,wonderkidozil@gmail.com,,,,,,,Soccer,More Information,The age and how long the trail process will be ? ,Athlete,02/04/2019 00:16,Sam,,,,,
Wamona,Wamona henriette,wamonahenrie@gmail.com,,2.43852E+11,,,,,Basketball,More Information,I want to know if you can give scholarship for high schools and college for women's basketball,Athlete,02/04/2019 04:24,Calum H,,,,,
