Firstname,Name,Email,Date of Birth,Mobile,Parent Name,Parent Mobile,Parent Email,Region,Sport,Call To Action,Message,Signedup By,Created,
Niamh,Niamh george,niamhg478@gmail.com,28/05/2002,7949102645,Sophie george,1404831694,sophie.m.george@gmail.com,South England,Hockey,Request A Prospectus by Email,,Athlete,27/03/2019 09:01,Annabel
Richard,Richard frempong junior ,Rick576@hotmail.co.uk,13/07/2000,07713 970051,Richard frempong,9.97957E+11,r.frempong@sky.com,South England,Soccer,Request A Prospectus by Email,,Athlete,27/03/2019 09:06,Matt
Kate-lyn,Kate-lyn kotze,kate-lyn.kotze@hotmail.com,20/10/2000,+44 7837522046,,,sjkotze@btinternet.com,South England,Hockey,Request A Prospectus by Email,,Athlete,27/03/2019 11:25,Sam
Tomas,Tomas agustin orsi,tomyorsi@gmail.com,,5.49113E+12,,,,International / Other,Soccer,General Enquiry,,Athlete,27/03/2019 21:57,Annabel
Lamiaa,Lamiaa ,lamiaaazib54637@gmail.com,,azib,,,,International / Other,Track & Field,General Enquiry,,Athlete,28/03/2019 01:15,Matt
Adam,Adam,adambenjenna@gmail.com,,9.71504E+11,,,,International / Other,Ice Hockey,General Enquiry,,Athlete,28/03/2019 07:01,SAm
Claudia,Claudia patricia correa hernández,correaclau@yahoo.es,,3.53864E+11,,,,Ireland,Soccer,General Enquiry,,Athlete,28/03/2019 07:57,Ross
Rose,Rose benton,rosebud-benton@outlook.com,,7802782369,,,,South England,Rugby,More Information,Hopefully it's okay to get some more information from you guys about what the whole programme is about. I would also like to know more about where the campuses are and how would I know what one would suit me best. Also what other things I would do/get involved with to do with the college and if there are any other subjects I take. As I'm from England do you have the same lessons/courses that I have hear that I can get involved with. I hope to hear from you soon as myself and my family are really looking into this. ,Athlete,27/03/2019 11:49,Calum H
Lochlainn,Lochlainn regan,lochlainnregan16@gmail.com,24/07/1998,83391171,,,leor@outlook.com,Ireland,Rugby,More Information,What level you need to have played at ,Athlete,27/03/2019 13:08,Ross
Marnix,Marnix posch,marnixposch@hotmail.nl,,31627223626,,,,International / Other,Basketball,More Information,How can you apply to this scholarship?,Athlete,27/03/2019 18:46,Calum H
Nyron,Nyron butcher,kamal.butcher@gmail.com,,4.47841E+11,,,,Midlands,Soccer,More Information,,Athlete,27/03/2019 20:28,Tracey
Darragh,Darragh carlin,darraghcarlin9@gmail.com,,854506858,,,,Ireland,Soccer,More Information,"Hugely interested in finding out more about your soccer trials , scholarships etc ",Athlete,27/03/2019 20:38,Ross
Owen,Owen henderson,owenhenderson@btinternet.com,19/12/2001,7539254290,,,,North England,,More Information,"I would like to know more about the Track and Field Scholarship. For example, how to start the process? ",Athlete,27/03/2019 21:22,Max
